Reaction Details
TargetIntegrin alpha-V/beta-3
LigandBDBM50177624
Substrate/Competitorn/a
Meas. Tech.ChEMBL_334209 (CHEMBL865264)
IC50 1.1±n/a nM
Citation Boys, MLSchretzman, LAChandrakumar, NSTollefson, MBMohler, SBDowns, VLPenning, TDRussell, MAWendt, JAChen, BBStenmark, HGWu, HSpangler, DPClare, MDesai, BNKhanna, IKNguyen, MNDuffin, TEngleman, VWFinn, MBFreeman, SKHanneke, MLKeene, JLKlover, JANickols, GANickols, MASteininger, CNWestlin, MWestlin, WYu, YXWang, YDalton, CRNorring, SA Convergent, parallel synthesis of a series of beta-substituted 1,2,4-oxadiazole butanoic acids as potent and selective alpha(v)beta3 receptor antagonists. Bioorg Med Chem Lett16:839-44 (2006) 
 
Integrin alpha-V/beta-3
Name:Integrin alpha-V/beta-3
Type:Enzyme
Mol. Mass.:n/a
Description:n/a
Components:This complex has 2 components.
Component 1
Name:Integrin alpha-V
Synonyms:ITAV_HUMAN Integrin alpha-V/alpha-5 VNRA Vitronectin receptor | Vitronectin receptor subunit alpha
Type:PROTEIN
Mol. Mass.:116024.92
Organism:Homo sapiens (Human)
Description:ChEMBL_582336
Residue:1048
Component 2
Name:Integrin beta-3
Synonyms:CD_antigen=CD61 GPIIIa ITGB3 Platelet membrane glycoprotein IIIa
Type:Protein
Mol. Mass.:87038.91
Organism:Homo sapiens (Human)
Description:P05106
Residue:788
BDBM50177624
NameBDBM50177624
Synonyms:3-(3-fluorophenyl)-4-(3-(3-(5,6,7,8-tetrahydro-1,8-naphthyridin-2-yl)propyl)-1,2,4-oxadiazol-5-yl)butanoic acid | CHEMBL203690
TypeSmall organic molecule
Emp. Form.C23H25FN4O3
Mol. Mass.424.468
SMILESOC(=O)CC(Cc1nc(CCCc2ccc3CCCNc3n2)no1)c1cccc(F)c1