Reaction Details
Target5-hydroxytryptamine receptor 1A
LigandBDBM50135249
Substrate/Competitorn/a
Meas. Tech.ChEMBL_349600 (CHEMBL866277)
Ki 5.65±n/a nM
Citation Takeuchi, KKohn, TJHonigschmidt, NARocco, VPSpinazze, PGHemrick-Luecke, SKThompson, LKEvans, DCRasmussen, KKoger, DLodge, DMartin, LJShaw, JThrelkeld, PGWong, DT Advances toward new antidepressants beyond SSRIs: 1-aryloxy-3-piperidinylpropan-2-ols with dual 5-HT1A receptor antagonism/SSRI activities. Part 5. Bioorg Med Chem Lett16:2347-51 (2006) 
 
5-hydroxytryptamine receptor 1A
Name:5-hydroxytryptamine receptor 1A
Type:n/a
Mol. Mass.:46122.49
Organism:Homo sapiens (Human)
Description:n/a
Residue:422
BDBM50135249
NameBDBM50135249
Synonyms:(S)-1-((2S,4R)-4-(5-fluorobenzo[b]thiophen-2-yl)-2-methylpiperidin-1-yl)-3-(2-methyl-1H-indol-4-yloxy)propan-2-ol CHEMBL129238
TypeSmall organic molecule
Emp. Form.C26H29FN2O2S
Mol. Mass.452.584
SMILESC[C@H]1C[C@@H](CCN1C[C@H](O)COc1cccc2[nH]c(C)cc12)c1cc2cc(F)ccc2s1