Reaction Details
TargetSodium-dependent serotonin transporter
LigandBDBM50130161
Substrate/Competitorn/a
Meas. Tech.ChEMBL_349601 (CHEMBL866278)
Ki 14.71±n/a nM
Citation Takeuchi, KKohn, TJHonigschmidt, NARocco, VPSpinazze, PGHemrick-Luecke, SKThompson, LKEvans, DCRasmussen, KKoger, DLodge, DMartin, LJShaw, JThrelkeld, PGWong, DT Advances toward new antidepressants beyond SSRIs: 1-aryloxy-3-piperidinylpropan-2-ols with dual 5-HT1A receptor antagonism/SSRI activities. Part 5. Bioorg Med Chem Lett16:2347-51 (2006) 
 
Sodium-dependent serotonin transporter
Name:Sodium-dependent serotonin transporter
Type:Multi-pass membrane protein
Mol. Mass.:70322.51
Organism:Homo sapiens (Human)
Description:P31645
Residue:630
BDBM50130161
NameBDBM50130161
Synonyms:(S)-1-(1H-Indol-4-yloxy)-3-[(4R,6R)-4-(4-methoxy-benzo[b]thiophen-2-yl)-2-methyl-piperidin-1-yl]-propan-2-ol CHEMBL307874
TypeSmall organic molecule
Emp. Form.C26H30N2O3S
Mol. Mass.450.593
SMILESCOc1cccc2sc(cc12)[C@@H]1CCN(C[C@H](O)COc2cccc3[nH]ccc23)[C@H](C)C1