Reaction Details
Target5-hydroxytryptamine receptor 1A
LigandBDBM50128368
Substrate/Competitorn/a
Meas. Tech.ChEMBL_349600 (CHEMBL866277)
Ki 1.89±n/a nM
Citation Takeuchi, KKohn, TJHonigschmidt, NARocco, VPSpinazze, PGHemrick-Luecke, SKThompson, LKEvans, DCRasmussen, KKoger, DLodge, DMartin, LJShaw, JThrelkeld, PGWong, DT Advances toward new antidepressants beyond SSRIs: 1-aryloxy-3-piperidinylpropan-2-ols with dual 5-HT1A receptor antagonism/SSRI activities. Part 5. Bioorg Med Chem Lett16:2347-51 (2006) 
 
5-hydroxytryptamine receptor 1A
Name:5-hydroxytryptamine receptor 1A
Type:n/a
Mol. Mass.:46122.49
Organism:Homo sapiens (Human)
Description:n/a
Residue:422
BDBM50128368
NameBDBM50128368
Synonyms:(S)-1-(1H-Indol-4-yloxy)-3-[4-(4-methoxy-benzo[b]thiophen-2-yl)-piperidin-1-yl]-propan-2-ol CHEMBL56795
TypeSmall organic molecule
Emp. Form.C25H28N2O3S
Mol. Mass.436.566
SMILESCOc1cccc2sc(cc12)C1CCN(C[C@H](O)COc2cccc3[nH]ccc23)CC1