Reaction Details
TargetSodium-dependent serotonin transporter
LigandBDBM50130152
Substrate/Competitorn/a
Meas. Tech.ChEMBL_349601 (CHEMBL866278)
Ki 0.31±n/a nM
Citation Takeuchi, KKohn, TJHonigschmidt, NARocco, VPSpinazze, PGHemrick-Luecke, SKThompson, LKEvans, DCRasmussen, KKoger, DLodge, DMartin, LJShaw, JThrelkeld, PGWong, DT Advances toward new antidepressants beyond SSRIs: 1-aryloxy-3-piperidinylpropan-2-ols with dual 5-HT1A receptor antagonism/SSRI activities. Part 5. Bioorg Med Chem Lett16:2347-51 (2006) 
 
Sodium-dependent serotonin transporter
Name:Sodium-dependent serotonin transporter
Type:Multi-pass membrane protein
Mol. Mass.:70322.51
Organism:Homo sapiens (Human)
Description:P31645
Residue:630
BDBM50130152
NameBDBM50130152
Synonyms:(S)-1-(1H-indol-4-yloxy)-3-((2S,4R)-4-(6-fluorobenzo[b]thiophen-2-yl)-2-methylpiperidin-1-yl)propan-2-ol CHEMBL309396
TypeSmall organic molecule
Emp. Form.C25H27FN2O2S
Mol. Mass.438.557
SMILESC[C@H]1C[C@@H](CCN1C[C@H](O)COc1cccc2[nH]ccc12)c1cc2ccc(F)cc2s1