Reaction Details
Target5'-nucleotidase
LigandBDBM18136
Substrate/Competitorn/a
Meas. Tech.ChEMBL_2232267 (CHEMBL5146039)
Ki 88±n/a nM
Citation Zhang, YYe, SWang, YWang, CZhu, YWu, YZhang, YZhang, HMiao, Z Discovery and optimization of betulinic acid derivatives as novel potent CD73 inhibitors. Bioorg Med Chem59:0 (2022) 
 
5'-nucleotidase
Name:5'-nucleotidase
Type:Enzyme
Mol. Mass.:63371.54
Organism:Homo sapiens (Human)
Description:P21589
Residue:574
BDBM18136
NameBDBM18136
Synonyms:ADP, alpha beta-me [({[(2R,3S,4R,5R)-5-(6-amino-9H-purin-9-yl)-3,4-dihydroxyoxolan-2-yl]methoxy}(hydroxy)phosphoryl)methyl]phosphonic acid cid_92199
TypeNucleoside or nucleotide
Emp. Form.C11H17N5O9P2
Mol. Mass.425.2283
SMILESNc1ncnc2n(cnc12)[C@@H]1O[C@H](COP(O)(=O)CP(O)(O)=O)[C@@H](O)[C@H]1O