Reaction Details
TargetAdenosine kinase
LigandBDBM50178013
Substrate/Competitorn/a
Meas. Tech.ChEMBL_325687 (CHEMBL864546)
IC50 1.3±n/a nM
Citation Bookser, BCUgarkar, BGMatelich, MCLemus, RHAllan, MTsuchiya, MNakane, MNagahisa, AWiesner, JBErion, MD Adenosine kinase inhibitors. 6. Synthesis, water solubility, and antinociceptive activity of 5-phenyl-7-(5-deoxy-beta-D-ribofuranosyl)pyrrolo[2,3-d]pyrimidines substituted at C4 with glycinamides and related compounds. J Med Chem48:7808-20 (2005) 
 
Adenosine kinase
Name:Adenosine kinase
Type:PROTEIN
Mol. Mass.:40545.97
Organism:Homo sapiens (Human)
Description:ChEMBL_1467841
Residue:362
BDBM50178013
NameBDBM50178013
Synonyms:CHEMBL372796 | N1-cyclopropyl-N2-(5-phenyl-7-(5-deoxy-beta-D-ribofuranosyl)-pyrrolo[2,3-d]pyrimidin-4-yl)oxalamide
TypeSmall organic molecule
Emp. Form.C22H23N5O5
Mol. Mass.437.4485
SMILESC[C@H]1O[C@H]([C@H](O)[C@@H]1O)n1cc(-c2ccccc2)c2c(NC(=O)C(=O)NC3CC3)ncnc12