Reaction Details
TargetAdenosine kinase
LigandBDBM50178018
Substrate/Competitorn/a
Meas. Tech.ChEMBL_325687 (CHEMBL864546)
IC50 0.9±n/a nM
Citation Bookser, BCUgarkar, BGMatelich, MCLemus, RHAllan, MTsuchiya, MNakane, MNagahisa, AWiesner, JBErion, MD Adenosine kinase inhibitors. 6. Synthesis, water solubility, and antinociceptive activity of 5-phenyl-7-(5-deoxy-beta-D-ribofuranosyl)pyrrolo[2,3-d]pyrimidines substituted at C4 with glycinamides and related compounds. J Med Chem48:7808-20 (2005) 
 
Adenosine kinase
Name:Adenosine kinase
Type:PROTEIN
Mol. Mass.:40545.97
Organism:Homo sapiens (Human)
Description:ChEMBL_1467841
Residue:362
BDBM50178018
NameBDBM50178018
Synonyms:2-(3-phenyl-1-(beta-D-ribofuranosyl)-pyrazolo[3,4-d]pyrimidin-4-ylamino)-N-phenylacetamide | CHEMBL198566
TypeSmall organic molecule
Emp. Form.C24H24N6O5
Mol. Mass.476.4846
SMILESOC[C@H]1O[C@H]([C@H](O)[C@@H]1O)n1nc(-c2ccccc2)c2c(NCC(=O)Nc3ccccc3)ncnc12