Reaction Details
TargetAdenosine kinase
LigandBDBM50178023
Substrate/Competitorn/a
Meas. Tech.ChEMBL_325687 (CHEMBL864546)
IC50 0.8±n/a nM
Citation Bookser, BCUgarkar, BGMatelich, MCLemus, RHAllan, MTsuchiya, MNakane, MNagahisa, AWiesner, JBErion, MD Adenosine kinase inhibitors. 6. Synthesis, water solubility, and antinociceptive activity of 5-phenyl-7-(5-deoxy-beta-D-ribofuranosyl)pyrrolo[2,3-d]pyrimidines substituted at C4 with glycinamides and related compounds. J Med Chem48:7808-20 (2005) 
 
Adenosine kinase
Name:Adenosine kinase
Type:PROTEIN
Mol. Mass.:40545.97
Organism:Homo sapiens (Human)
Description:ChEMBL_1467841
Residue:362
BDBM50178023
NameBDBM50178023
Synonyms:2-(5-phenyl-7-(5-deoxy-beta-D-ribofuranosyl)-pyrrolo[2,3-d]pyrimidin-4-ylamino)-N-methylacetamide | CHEMBL200630
TypeSmall organic molecule
Emp. Form.C20H23N5O4
Mol. Mass.397.4277
SMILESCNC(=O)CNc1ncnc2n(cc(-c3ccccc3)c12)[C@@H]1O[C@H](C)[C@@H](O)[C@H]1O