Reaction Details
TargetSubstance-P receptor
LigandBDBM50178559
Substrate/Competitorn/a
Meas. Tech.ChEMBL_337893 (CHEMBL868375)
Ki 295±n/a nM
Citation Hoffmann, TBös, MStadler, HSchnider, PHunkeler, WGodel, TGalley, GBallard, TMHiggins, GAPoli, SMSleight, AJ Design and synthesis of a novel, achiral class of highly potent and selective, orally active neurokinin-1 receptor antagonists. Bioorg Med Chem Lett16:1362-5 (2006) 
 
Substance-P receptor
Name:Substance-P receptor
Type:G Protein-Coupled Receptor (GPCR)
Mol. Mass.:46254.43
Organism:Homo sapiens (Human)
Description:P25103
Residue:407
BDBM50178559
NameBDBM50178559
Synonyms:CHEMBL436951 | biphenyl-2-carboxylic acid [1-(3,5-bis-trifluoromethyl-phenyl)-1-methyl-ethyl]-methyl-amide
TypeSmall organic molecule
Emp. Form.C25H21F6NO
Mol. Mass.465.4308
SMILESCN(C(=O)c1ccccc1-c1ccccc1)C(C)(C)c1cc(cc(c1)C(F)(F)F)C(F)(F)F