Reaction Details
TargetSubstance-P receptor
LigandBDBM50178563
Substrate/Competitorn/a
Meas. Tech.ChEMBL_337893 (CHEMBL868375)
Ki 933±n/a nM
Citation Hoffmann, TBös, MStadler, HSchnider, PHunkeler, WGodel, TGalley, GBallard, TMHiggins, GAPoli, SMSleight, AJ Design and synthesis of a novel, achiral class of highly potent and selective, orally active neurokinin-1 receptor antagonists. Bioorg Med Chem Lett16:1362-5 (2006) 
 
Substance-P receptor
Name:Substance-P receptor
Type:G Protein-Coupled Receptor (GPCR)
Mol. Mass.:46254.43
Organism:Homo sapiens (Human)
Description:P25103
Residue:407
BDBM50178563
NameBDBM50178563
Synonyms:CHEMBL383289 | N-[1-biphenyl-2-yl-methylidene]-N'-(3,5-dichloro-pyridin-4-yl)-hydrazine
TypeSmall organic molecule
Emp. Form.C18H13Cl2N3
Mol. Mass.342.222
SMILESClc1cncc(Cl)c1N=NCc1ccccc1-c1ccccc1