Reaction Details
TargetSubstance-P receptor
LigandBDBM50178568
Substrate/Competitorn/a
Meas. Tech.ChEMBL_337893 (CHEMBL868375)
Ki 15±n/a nM
Citation Hoffmann, TBös, MStadler, HSchnider, PHunkeler, WGodel, TGalley, GBallard, TMHiggins, GAPoli, SMSleight, AJ Design and synthesis of a novel, achiral class of highly potent and selective, orally active neurokinin-1 receptor antagonists. Bioorg Med Chem Lett16:1362-5 (2006) 
 
Substance-P receptor
Name:Substance-P receptor
Type:G Protein-Coupled Receptor (GPCR)
Mol. Mass.:46254.43
Organism:Homo sapiens (Human)
Description:P25103
Residue:407
BDBM50178568
NameBDBM50178568
Synonyms:1-((3-(2,6-dichlorophenyl)-5-methylisoxazol-4-yl)methylene)-2-(3,5-dichloropyridin-4-yl)hydrazine | CHEMBL204327
TypeSmall organic molecule
Emp. Form.C16H10Cl4N4O
Mol. Mass.416.089
SMILESCc1onc(c1CN=Nc1c(Cl)cncc1Cl)-c1c(Cl)cccc1Cl