Reaction Details
TargetHolo-[acyl-carrier-protein] synthase
LigandBDBM25902
Substrate/Competitorn/a
Meas. Tech.ChEMBL_326222 (CHEMBL867576)
IC50 12700±n/a nM
Citation Joseph-McCarthy, DParris, KHuang, AFailli, AQuagliato, DDushin, EGNovikova, ESeverina, ETuckman, MPetersen, PJDean, CFritz, CCMeshulam, TDeCenzo, MDick, LMcFadyen, IJSomers, WSLovering, FGilbert, AM Use of structure-based drug design approaches to obtain novel anthranilic acid acyl carrier protein synthase inhibitors. J Med Chem48:7960-9 (2005) 
 
Holo-[acyl-carrier-protein] synthase
Name:Holo-[acyl-carrier-protein] synthase
Type:PROTEIN
Mol. Mass.:13724.66
Organism:Bacillus subtilis
Description:ChEMBL_326222
Residue:121
BDBM25902
NameBDBM25902
Synonyms:4-chloro-2-[(furan-2-ylmethyl)amino]-5-sulfamoylbenzoic acid Frusemide Furosemide Furosemide, 4 US10172837, Furosemide
TypeSmall organic molecule
Emp. Form.C12H11ClN2O5S
Mol. Mass.330.744
SMILESNS(=O)(=O)c1cc(C(O)=O)c(NCc2ccco2)cc1Cl