Reaction Details
TargetDelta-type opioid receptor
LigandBDBM50178759
Substrate/Competitorn/a
Meas. Tech.ChEMBL_326438 (CHEMBL867596)
IC50>10000±n/a nM
Citation Li, TFujita, YShiotani, KMiyazaki, ATsuda, YAmbo, ASasaki, YJinsmaa, YMarczak, EBryant, SDSalvadori, SLazarus, LHOkada, Y Potent Dmt-Tic pharmacophoric delta- and mu-opioid receptor antagonists. J Med Chem48:8035-44 (2005) 
 
Delta-type opioid receptor
Name:Delta-type opioid receptor
Type:Enzyme Catalytic Domain
Mol. Mass.:40577.25
Organism:MOUSE
Description:P32300
Residue:372
BDBM50178759
NameBDBM50178759
Synonyms:1,6-bis-(N,N-dimethyl-Dmt-Tic-NH)hexane | CHEMBL370399
TypeSmall organic molecule
Emp. Form.C52H68N6O6
Mol. Mass.873.1329
SMILESCN(C)[C@@H](Cc1c(C)cc(O)cc1C)C(=O)N1Cc2ccccc2CC1C(=O)NCCCCCCNC(=O)C1Cc2ccccc2CN1C(=O)[C@H](Cc1c(C)cc(O)cc1C)N(C)C