Reaction Details
TargetDelta-type opioid receptor
LigandBDBM50178763
Substrate/Competitorn/a
Meas. Tech.ChEMBL_326435 (CHEMBL867593)
Ki 0.155±n/a nM
Citation Li, TFujita, YShiotani, KMiyazaki, ATsuda, YAmbo, ASasaki, YJinsmaa, YMarczak, EBryant, SDSalvadori, SLazarus, LHOkada, Y Potent Dmt-Tic pharmacophoric delta- and mu-opioid receptor antagonists. J Med Chem48:8035-44 (2005) 
 
Delta-type opioid receptor
Name:Delta-type opioid receptor
Type:G Protein-Coupled Receptor (GPCR)
Mol. Mass.:40465.04
Organism:Rattus norvegicus (rat)
Description:Competition binding assays were using CHO-K1 cell membranes expressing the opioid receptor.
Residue:372
BDBM50178763
NameBDBM50178763
Synonyms:3,6-bis(Dmt-Tic-NH-propyl)-2(1H)-pyrazinone | CHEMBL381874
TypeSmall organic molecule
Emp. Form.C53H64N8O7
Mol. Mass.925.1247
SMILESCc1cc(O)cc(C)c1C[C@H](N)C(=O)N1Cc2ccccc2CC1C(=O)NCCCc1[nH]c(=O)c(CCCNC(=O)C2Cc3ccccc3CN2C(=O)[C@@H](N)Cc2c(C)cc(O)cc2C)nc1C