Reaction Details
TargetDelta-type opioid receptor
LigandBDBM50178765
Substrate/Competitorn/a
Meas. Tech.ChEMBL_326435 (CHEMBL867593)
Ki 0.124±n/a nM
Citation Li, TFujita, YShiotani, KMiyazaki, ATsuda, YAmbo, ASasaki, YJinsmaa, YMarczak, EBryant, SDSalvadori, SLazarus, LHOkada, Y Potent Dmt-Tic pharmacophoric delta- and mu-opioid receptor antagonists. J Med Chem48:8035-44 (2005) 
 
Delta-type opioid receptor
Name:Delta-type opioid receptor
Type:G Protein-Coupled Receptor (GPCR)
Mol. Mass.:40465.04
Organism:Rattus norvegicus (rat)
Description:Competition binding assays were using CHO-K1 cell membranes expressing the opioid receptor.
Residue:372
BDBM50178765
NameBDBM50178765
Synonyms:1,4-bis-(Dmt-Tic-amino)butane | CHEMBL370197
TypeSmall organic molecule
Emp. Form.C46H56N6O6
Mol. Mass.788.9734
SMILESCc1cc(O)cc(C)c1C[C@H](N)C(=O)N1Cc2ccccc2CC1C(=O)NCCCCNC(=O)C1Cc2ccccc2CN1C(=O)[C@@H](N)Cc1c(C)cc(O)cc1C