Reaction Details
TargetTrypanothione reductase
LigandBDBM50178803
Substrate/Competitorn/a
Meas. Tech.ChEMBL_326421 (CHEMBL864479)
Ki 180±n/a nM
Citation Parveen, SKhan, MOAustin, SECroft, SLYardley, VRock, PDouglas, KT Antitrypanosomal, antileishmanial, and antimalarial activities of quaternary arylalkylammonium 2-amino-4-chlorophenyl phenyl sulfides, a new class of trypanothione reductase inhibitor, and of N-acyl derivatives of 2-amino-4-chlorophenyl phenyl sulfide. J Med Chem48:8087-97 (2005) 
 
Trypanothione reductase
Name:Trypanothione reductase
Type:Homodimer; oxidoreductase
Mol. Mass.:53868.26
Organism:Trypanosoma cruzi
Description:n/a
Residue:492
BDBM50178803
NameBDBM50178803
Synonyms:3,4-dichloro-N-(3-(2-chloro-10H-phenothiazin-10-yl)propyl)-N,N-dimethylbenzenaminium | CHEMBL197230
TypeSmall organic molecule
Emp. Form.C23H22Cl3N2S
Mol. Mass.464.858
SMILESC[N+](C)(CCCN1c2ccccc2Sc2ccc(Cl)cc12)c1ccc(Cl)c(Cl)c1