Reaction Details
TargetMitogen-activated protein kinase 14
LigandBDBM50178832
Substrate/Competitorn/a
Meas. Tech.ChEMBL_339827 (CHEMBL862178)
IC50 180±n/a nM
Citation Swahn, BMXue, YArzel, EKallin, EMagnus, APlobeck, NViklund, J Design and synthesis of 2'-anilino-4,4'-bipyridines as selective inhibitors of c-Jun N-terminal kinase-3. Bioorg Med Chem Lett16:1397-401 (2006) 
 
Mitogen-activated protein kinase 14
Name:Mitogen-activated protein kinase 14
Type:Serine/threonine-protein kinase
Mol. Mass.:41286.76
Organism:Homo sapiens (Human)
Description:Q16539
Residue:360
BDBM50178832
NameBDBM50178832
Synonyms:CHEMBL203535 N-(4-(2-(phenylamino)pyridin-4-yl)pyridin-2-yl)-tetrahydrofuran-3-carboxamide
TypeSmall organic molecule
Emp. Form.C21H20N4O2
Mol. Mass.360.4091
SMILESO=C(Nc1cc(ccn1)-c1ccnc(Nc2ccccc2)c1)C1CCOC1