Reaction Details
TargetSodium channel protein type 9 subunit alpha
LigandBDBM50178856
Substrate/Competitorn/a
Meas. Tech.ChEMBL_337839 (CHEMBL866524)
Ki 1110±n/a nM
Citation Ok, DLi, CAbbadie, CFelix, JPFisher, MHGarcia, MLKaczorowski, GJLyons, KAMartin, WJPriest, BTSmith, MMWilliams, BSWyvratt, MJParsons, WH Synthesis and SAR of 1,2-trans-(1-hydroxy-3-phenylprop-1-yl)cyclopentane carboxamide derivatives, a new class of sodium channel blockers. Bioorg Med Chem Lett16:1358-61 (2006) 
 
Sodium channel protein type 9 subunit alpha
Name:Sodium channel protein type 9 subunit alpha
Type:Protein
Mol. Mass.:226375.97
Organism:Homo sapiens (Human)
Description:Q15858
Residue:1988
BDBM50178856
NameBDBM50178856
Synonyms:1-(trans-2-((3,5-dichlorobenzyloxy)methyl)cyclopentyl)-3-phenylpropan-1-ol | CHEMBL381052
TypeSmall organic molecule
Emp. Form.C22H26Cl2O2
Mol. Mass.393.347
SMILESOC(CCc1ccccc1)[C@@H]1CCC[C@H]1COCc1cc(Cl)cc(Cl)c1