Reaction Details
TargetRetinoic acid receptor RXR-beta
LigandBDBM50179118
Substrate/Competitorn/a
Meas. Tech.ChEMBL_349698 (CHEMBL866289)
EC50 161±n/a nM
Citation Farmer, LJMarron, KSCanan Koch, SSHwang, CKKallel, EAZhi, LNadzan, AMRobertson, DWBennani, YL Aza-retinoids as novel retinoid X receptor-specific agonists. Bioorg Med Chem Lett16:2352-6 (2006) 
 
Retinoic acid receptor RXR-beta
Name:Retinoic acid receptor RXR-beta
Type:PROTEIN
Mol. Mass.:56932.89
Organism:Homo sapiens (Human)
Description:ChEMBL_39045
Residue:533
BDBM50179118
NameBDBM50179118
Synonyms:(S,2E,4E)-3-methyl-5-(1-(5,5,8,8-tetramethyl-5,6,7,8-tetrahydronaphthalen-2-yl)pyrrolidin-2-yl)penta-2,4-dienoic acid | CHEMBL378926
TypeSmall organic molecule
Emp. Form.C24H33NO2
Mol. Mass.367.5243
SMILESC\C(\C=C\[C@@H]1CCCN1c1ccc2c(c1)C(C)(C)CCC2(C)C)=C/C(O)=O