Reaction Details
TargetRetinoic acid receptor RXR-beta
LigandBDBM50179123
Substrate/Competitorn/a
Meas. Tech.ChEMBL_349698 (CHEMBL866289)
EC50 169±n/a nM
Citation Farmer, LJMarron, KSCanan Koch, SSHwang, CKKallel, EAZhi, LNadzan, AMRobertson, DWBennani, YL Aza-retinoids as novel retinoid X receptor-specific agonists. Bioorg Med Chem Lett16:2352-6 (2006) 
 
Retinoic acid receptor RXR-beta
Name:Retinoic acid receptor RXR-beta
Type:PROTEIN
Mol. Mass.:56932.89
Organism:Homo sapiens (Human)
Description:ChEMBL_39045
Residue:533
BDBM50179123
NameBDBM50179123
Synonyms:(2E,4E)-6-((3-methoxy-5,5,8,8-tetramethyl-5,6,7,8-tetrahydronaphthalen-2-yl)(propyl)amino)-3-methylhexa-2,4-dienoic acid | CHEMBL204773
TypeSmall organic molecule
Emp. Form.C25H37NO3
Mol. Mass.399.5662
SMILESCCCN(C\C=C\C(\C)=C\C(O)=O)c1cc2c(cc1OC)C(C)(C)CCC2(C)C