Reaction Details
TargetPeroxisome proliferator-activated receptor gamma
LigandBDBM50179236
Substrate/Competitorn/a
Meas. Tech.ChEMBL_325379 (CHEMBL861059)
IC50 152±n/a nM
Citation Mahindroo, NHuang, CFPeng, YHWang, CCLiao, CCLien, TWChittimalla, SKHuang, WJChai, CHPrakash, EChen, CPHsu, TAPeng, CHLu, ILLee, LHChang, YWChen, WCChou, YCChen, CTGoparaju, CMChen, YSLan, SJYu, MCChen, XChao, YSWu, SYHsieh, HP Novel indole-based peroxisome proliferator-activated receptor agonists: design, SAR, structural biology, and biological activities. J Med Chem48:8194-208 (2005) 
 
Peroxisome proliferator-activated receptor gamma
Name:Peroxisome proliferator-activated receptor gamma
Type:Nuclear Receptor
Mol. Mass.:57613.46
Organism:Homo sapiens (Human)
Description:P37231
Residue:505
BDBM50179236
NameBDBM50179236
Synonyms:2-(5-(3-(7-propyl-3-(trifluoromethyl)benzo[d]isoxazol-6-yloxy)propoxy)-1H-indol-1-yl)acetic acid CHEMBL200495
TypeSmall organic molecule
Emp. Form.C24H23F3N2O5
Mol. Mass.476.445
SMILESCCCc1c(OCCCOc2ccc3n(CC(O)=O)ccc3c2)ccc2c(noc12)C(F)(F)F