Reaction Details
TargetPeroxisome proliferator-activated receptor gamma
LigandBDBM50179240
Substrate/Competitorn/a
Meas. Tech.ChEMBL_325379 (CHEMBL861059)
IC50 584±n/a nM
Citation Mahindroo, NHuang, CFPeng, YHWang, CCLiao, CCLien, TWChittimalla, SKHuang, WJChai, CHPrakash, EChen, CPHsu, TAPeng, CHLu, ILLee, LHChang, YWChen, WCChou, YCChen, CTGoparaju, CMChen, YSLan, SJYu, MCChen, XChao, YSWu, SYHsieh, HP Novel indole-based peroxisome proliferator-activated receptor agonists: design, SAR, structural biology, and biological activities. J Med Chem48:8194-208 (2005) 
 
Peroxisome proliferator-activated receptor gamma
Name:Peroxisome proliferator-activated receptor gamma
Type:Nuclear Receptor
Mol. Mass.:57613.46
Organism:Homo sapiens (Human)
Description:P37231
Residue:505
BDBM50179240
NameBDBM50179240
Synonyms:3-{5-[3-(7-propyl-3-trifluoromethylbenzo[d]isoxazol-6-yloxy)propoxy]-1H-indol-1-yl}propanoic acid | CHEMBL371098
TypeSmall organic molecule
Emp. Form.C25H25F3N2O5
Mol. Mass.490.4716
SMILESCCCc1c(OCCCOc2ccc3n(CCC(O)=O)ccc3c2)ccc2c(noc12)C(F)(F)F