Reaction Details
TargetBile salt-activated lipase
LigandBDBM50179311
Substrate/Competitorn/a
Meas. Tech.ChEMBL_325182 (CHEMBL861460)
Ki 18000±n/a nM
Citation Pietsch, MGütschow, M Synthesis of tricyclic 1,3-oxazin-4-ones and kinetic analysis of cholesterol esterase and acetylcholinesterase inhibition. J Med Chem48:8270-88 (2005) 
 
Bile salt-activated lipase
Name:Bile salt-activated lipase
Type:PROTEIN
Mol. Mass.:65152.77
Organism:Bos taurus
Description:ChEMBL_154778
Residue:597
BDBM50179311
NameBDBM50179311
Synonyms:2-(cyclohexyl-methyl-amino)-5,6,7,8-tetrahydro-benzo[4,5]thieno[2,3-d][1,3]oxazin-4-one | CHEMBL49480
TypeSmall organic molecule
Emp. Form.C17H22N2O2S
Mol. Mass.318.434
SMILESCN(C1CCCCC1)c1nc2sc3CCCCc3c2c(=O)o1