Reaction Details
TargetBile salt-activated lipase
LigandBDBM50179333
Substrate/Competitorn/a
Meas. Tech.ChEMBL_325182 (CHEMBL861460)
Ki>50000±n/a nM
Citation Pietsch, MGütschow, M Synthesis of tricyclic 1,3-oxazin-4-ones and kinetic analysis of cholesterol esterase and acetylcholinesterase inhibition. J Med Chem48:8270-88 (2005) 
 
Bile salt-activated lipase
Name:Bile salt-activated lipase
Type:PROTEIN
Mol. Mass.:65152.77
Organism:Bos taurus
Description:ChEMBL_154778
Residue:597
BDBM50179333
NameBDBM50179333
Synonyms:5,6,7,8-tetrahydro-7-methyl-2-(dimethylamino)-4H-pyrido[4',3':4,5]thieno[2,3-d][1,3]oxazin-4-one | CHEMBL107994
TypeSmall organic molecule
Emp. Form.C12H15N3O2S
Mol. Mass.265.331
SMILESCN(C)c1nc2sc3CN(C)CCc3c2c(=O)o1