Reaction Details
TargetBile salt-activated lipase
LigandBDBM50179315
Substrate/Competitorn/a
Meas. Tech.ChEMBL_325182 (CHEMBL861460)
Ki>50000±n/a nM
Citation Pietsch, MGütschow, M Synthesis of tricyclic 1,3-oxazin-4-ones and kinetic analysis of cholesterol esterase and acetylcholinesterase inhibition. J Med Chem48:8270-88 (2005) 
 
Bile salt-activated lipase
Name:Bile salt-activated lipase
Type:PROTEIN
Mol. Mass.:65152.77
Organism:Bos taurus
Description:ChEMBL_154778
Residue:597
BDBM50179315
NameBDBM50179315
Synonyms:7-benzyl-2-diethylamino-5,6,7,8-tetrahydro-4H-pyrido[4',3':4,5]thieno[2,3-d][1,3]oxazin-4-one | CHEMBL8523
TypeSmall organic molecule
Emp. Form.C20H23N3O2S
Mol. Mass.369.481
SMILESCCN(CC)c1nc2sc3CN(Cc4ccccc4)CCc3c2c(=O)o1