Reaction Details
TargetMelanocyte-stimulating hormone receptor
LigandBDBM50179460
Substrate/Competitorn/a
Meas. Tech.ChEMBL_339209 (CHEMBL866556)
Ki 9±n/a nM
Citation Tian, XChen, XGan, LHayes, JCSwitzer, AGSolinsky, MGEbetino, FHWos, JAPinney, BBFarmer, JACrossdoersen, DSheldon, RJ Synthesis of Tic-D-Phe Psi[CH2-CH2] isostere and its use in the development of melanocortin receptor agonists. Bioorg Med Chem Lett16:1721-5 (2006) 
 
Melanocyte-stimulating hormone receptor
Name:Melanocyte-stimulating hormone receptor
Type:Enzyme
Mol. Mass.:34717.23
Organism:Homo sapiens (Human)
Description:Q01726
Residue:317
BDBM50179460
NameBDBM50179460
Synonyms:(R)-2-acetylamino-N-{(R)-1-benzyl-2-[(2S,4R)-4-benzyloxy-2-(3-guanidino-propyl)-pyrrolidin-1-yl]-2-oxo-ethyl}-3-(4-hydroxy-phenyl)-propionamide | CHEMBL380120
TypeSmall organic molecule
Emp. Form.C35H44N6O5
Mol. Mass.628.7611
SMILES[#6]-[#6](=O)-[#7]-[#6@H](-[#6]-c1ccc(-[#8])cc1)-[#6](=O)-[#7]-[#6@H](-[#6]-c1ccccc1)-[#6](=O)-[#7]-1-[#6]-[#6@@H](-[#6]-[#6@@H]-1-[#6]-[#6]-[#6]\[#7]=[#6](\[#7])-[#7])-[#8]-[#6]-c1ccccc1