Reaction Details
TargetProstaglandin G/H synthase 1
LigandBDBM50179624
Substrate/Competitorn/a
Meas. Tech.ChEMBL_336082 (CHEMBL865933)
IC50 100±n/a nM
Citation Sakya, SMCheng, HLundy Demello, KMShavnya, AMinich, MLRast, BDutra, JLi, CRafka, RJKoss, DALi, JJaynes, BHZiegler, CBMann, DWPetras, CFSeibel, SBSilvia, AMGeorge, DMHickman, AHaven, MLLynch, MP 5-Heteroatom-substituted pyrazoles as canine COX-2 inhibitors: Part 2. Structure-activity relationship studies of 5-alkylethers and 5-thioethers. Bioorg Med Chem Lett16:1202-6 (2006) 
 
Prostaglandin G/H synthase 1
Name:Prostaglandin G/H synthase 1
Type:PROTEIN
Mol. Mass.:69314.28
Organism:Canis familiaris
Description:ChEMBL_327426
Residue:603
BDBM50179624
NameBDBM50179624
Synonyms:5-(2,3-dimethylphenoxy)-1-(5-(methylsulfonyl)pyridin-2-yl)-3-(trifluoromethyl)-1H-pyrazole-4-carbonitrile | CHEMBL202856
TypeSmall organic molecule
Emp. Form.C19H15F3N4O3S
Mol. Mass.436.408
SMILESCc1cccc(Oc2c(C#N)c(nn2-c2ccc(cn2)S(C)(=O)=O)C(F)(F)F)c1C