Reaction Details
TargetAromatase
LigandBDBM50179636
Substrate/Competitorn/a
Meas. Tech.ChEMBL_335115 (CHEMBL859206)
IC50 26.3±n/a nM
Citation Lézé, MPLe Borgne, MPinson, PPalusczak, ADuflos, MLe Baut, GHartmann, RW Synthesis and biological evaluation of 5-[(aryl)(1H-imidazol-1-yl)methyl]-1H-indoles: potent and selective aromatase inhibitors. Bioorg Med Chem Lett16:1134-7 (2006) 
 
Aromatase
Name:Aromatase
Type:Enzyme
Mol. Mass.:57888.92
Organism:Homo sapiens (Human)
Description:P11511
Residue:503
BDBM50179636
NameBDBM50179636
Synonyms:5-((4-fluorophenyl)(1H-imidazol-1-yl)methyl)-1H-indole | CHEMBL203981
TypeSmall organic molecule
Emp. Form.C18H14FN3
Mol. Mass.291.3223
SMILESFc1ccc(cc1)C(c1ccc2[nH]ccc2c1)n1ccnc1