Reaction Details
TargetGamma-aminobutyric acid receptor subunit alpha-1/beta-3/gamma-2
LigandBDBM50179930
Substrate/Competitorn/a
Meas. Tech.ChEMBL_340477 (CHEMBL864376)
Ki 4.35±n/a nM
Citation Humphries, ACGancia, EGilligan, MTGoodacre, SHallett, DMerchant, KJThomas, SR 8-Fluoroimidazo[1,2-a]pyridine: synthesis, physicochemical properties and evaluation as a bioisosteric replacement for imidazo[1,2-a]pyrimidine in an allosteric modulator ligand of the GABA A receptor. Bioorg Med Chem Lett16:1518-22 (2006) 
 
Gamma-aminobutyric acid receptor subunit alpha-1/beta-3/gamma-2
Name:Gamma-aminobutyric acid receptor subunit alpha-1/beta-3/gamma-2
Type:Protein
Mol. Mass.:n/a
Description:n/a
Components:This complex has 3 components.
Component 1
Name:Gamma-aminobutyric acid receptor subunit alpha-1
Synonyms:Benzodiazepine central GABA A Benzodiazepine liver GABA(A) receptor subunit alpha-1 GABA-A receptor GBRA1_HUMAN TBPS | agonist GABA site
Type:Protein
Mol. Mass.:51817.35
Organism:Homo sapiens (Human)
Description:P14867
Residue:456
Component 2
Name:Gamma-aminobutyric acid receptor subunit beta-3
Synonyms:GABA A receptor alpha-4/beta-3/gamma-2 GABA-A receptor GBRB3_HUMAN | agonist GABA site
Type:PROTEIN
Mol. Mass.:54130.51
Organism:Homo sapiens (Human)
Description:ChEMBL_448071
Residue:473
Component 3
Name:Gamma-aminobutyric acid receptor subunit gamma-2
Synonyms:GABA(A) receptor subunit gamma-2 GBRG2_HUMAN
Type:PROTEIN
Mol. Mass.:54172.74
Organism:Homo sapiens (Human)
Description:EBI_217
Residue:467
BDBM50179930
NameBDBM50179930
Synonyms:2'-Fluoro-5'-[7-(1-hydroxy-1-methyl-ethyl)-imidazo[1,2-a]pyridin-3-yl]-biphenyl-2-carbonitrile | CHEMBL206196
TypeSmall organic molecule
Emp. Form.C23H18FN3O
Mol. Mass.371.4069
SMILESCC(C)(O)c1ccn2c(cnc2c1)-c1ccc(F)c(c1)-c1ccccc1C#N