Reaction Details
Target17-beta-hydroxysteroid dehydrogenase type 3
LigandBDBM50179948
Substrate/Competitorn/a
Meas. Tech.ChEMBL_340361 (CHEMBL864402)
IC50 160±n/a nM
Citation Fink, BEGavai, AVTokarski, JSGoyal, BMisra, RXiao, HYKimball, SDHan, WCNorris, DSpires, TEYou, DGottardis, MMLorenzi, MVVite, GD Identification of a novel series of tetrahydrodibenzazocines as inhibitors of 17beta-hydroxysteroid dehydrogenase type 3. Bioorg Med Chem Lett16:1532-6 (2006) 
 
17-beta-hydroxysteroid dehydrogenase type 3
Name:17-beta-hydroxysteroid dehydrogenase type 3
Type:Enzyme
Mol. Mass.:34525.39
Organism:Homo sapiens (Human)
Description:P37058
Residue:310
BDBM50179948
NameBDBM50179948
Synonyms:CHEMBL202841 | N-(5-acetyl-5,6,11,12-tetrahydro-dibenzo[b,f]azocin-9-yl)-benzamide
TypeSmall organic molecule
Emp. Form.C24H22N2O2
Mol. Mass.370.4437
SMILESCC(=O)N1Cc2ccc(NC(=O)c3ccccc3)cc2CCc2ccccc12