Reaction Details
Target17-beta-hydroxysteroid dehydrogenase type 3
LigandBDBM50179967
Substrate/Competitorn/a
Meas. Tech.ChEMBL_340361 (CHEMBL864402)
IC50 1.4±n/a nM
Citation Fink, BEGavai, AVTokarski, JSGoyal, BMisra, RXiao, HYKimball, SDHan, WCNorris, DSpires, TEYou, DGottardis, MMLorenzi, MVVite, GD Identification of a novel series of tetrahydrodibenzazocines as inhibitors of 17beta-hydroxysteroid dehydrogenase type 3. Bioorg Med Chem Lett16:1532-6 (2006) 
 
17-beta-hydroxysteroid dehydrogenase type 3
Name:17-beta-hydroxysteroid dehydrogenase type 3
Type:Enzyme
Mol. Mass.:34525.39
Organism:Homo sapiens (Human)
Description:P37058
Residue:310
BDBM50179967
NameBDBM50179967
Synonyms:3-(5-acetyl-2-chloro-5,6,11,12-tetrahydro-dibenzo[b,f]azocin-8-yl)-benzoic acid methyl ester | CHEMBL383546
TypeSmall organic molecule
Emp. Form.C25H22ClNO3
Mol. Mass.419.9
SMILESCOC(=O)c1cccc(c1)-c1ccc2CCc3cc(Cl)ccc3N(Cc2c1)C(C)=O