Reaction Details
Target17-beta-hydroxysteroid dehydrogenase type 3
LigandBDBM50179972
Substrate/Competitorn/a
Meas. Tech.ChEMBL_340361 (CHEMBL864402)
IC50 100±n/a nM
Citation Fink, BEGavai, AVTokarski, JSGoyal, BMisra, RXiao, HYKimball, SDHan, WCNorris, DSpires, TEYou, DGottardis, MMLorenzi, MVVite, GD Identification of a novel series of tetrahydrodibenzazocines as inhibitors of 17beta-hydroxysteroid dehydrogenase type 3. Bioorg Med Chem Lett16:1532-6 (2006) 
 
17-beta-hydroxysteroid dehydrogenase type 3
Name:17-beta-hydroxysteroid dehydrogenase type 3
Type:Enzyme
Mol. Mass.:34525.39
Organism:Homo sapiens (Human)
Description:P37058
Residue:310
BDBM50179972
NameBDBM50179972
Synonyms:1-(3-chloro-6,11-dihydro-5-thia-12-aza-dibenzo[a,e]cycloocten-12-yl)-ethanone | CHEMBL206535
TypeSmall organic molecule
Emp. Form.C16H14ClNOS
Mol. Mass.303.806
SMILESCC(=O)N1Cc2ccccc2CSc2cc(Cl)ccc12