Reaction Details
TargetMatrix metalloproteinase-9
LigandBDBM50138684
Substrate/Competitorn/a
Meas. Tech.ChEMBL_329822 (CHEMBL862785)
Ki 10±n/a nM
Citation Pirard, BMatter, H Matrix metalloproteinase target family landscape: a chemometrical approach to ligand selectivity based on protein binding site analysis. J Med Chem49:51-69 (2006) 
 
Matrix metalloproteinase-9
Name:Matrix metalloproteinase-9
Type:Enzyme
Mol. Mass.:78452.28
Organism:Homo sapiens (Human)
Description:P14780
Residue:707
BDBM50138684
NameBDBM50138684
Synonyms:(1-Benzyloxycarbonylamino-2-phenyl-ethyl)-{2-[1-carbamoyl-2-(1H-indol-3-yl)-ethylcarbamoyl]-5-phenyl-pentyl}-phosphinic acid CHEMBL115774
TypeSmall organic molecule
Emp. Form.C39H43N4O6P
Mol. Mass.694.7557
SMILESNC(=O)C(Cc1c[nH]c2ccccc12)NC(=O)C(CCCc1ccccc1)CP(O)(=O)C(Cc1ccccc1)NC(=O)OCc1ccccc1