Reaction Details
TargetHeat shock protein HSP 90-beta
LigandBDBM50165272
Substrate/Competitorn/a
Meas. Tech.ChEMBL_329521 (CHEMBL859805)
EC50 50.4±n/a nM
Citation He, HZatorska, DKim, JAguirre, JLlauger, LShe, YWu, NImmormino, RMGewirth, DTChiosis, G Identification of potent water soluble purine-scaffold inhibitors of the heat shock protein 90. J Med Chem49:381-90 (2006) 
 
Heat shock protein HSP 90-beta
Name:Heat shock protein HSP 90-beta
Type:Molecular Chaperone
Mol. Mass.:83229.45
Organism:Homo sapiens (Human)
Description:P08238
Residue:724
BDBM50165272
NameBDBM50165272
Synonyms:8-(6-Bromo-benzo[1,3]dioxol-5-ylsulfanyl)-9-pent-4-ynyl-9H-purin-6-ylamine CHEMBL365159 | US10676476, Example 1
TypeSmall organic molecule
Emp. Form.C17H14BrN5O2S
Mol. Mass.432.294
SMILESNc1ncnc2n(CCCC#C)c(Sc3cc4OCOc4cc3Br)nc12