Reaction Details
TargetHeat shock protein HSP 90-beta
LigandBDBM50180302
Substrate/Competitorn/a
Meas. Tech.ChEMBL_329521 (CHEMBL859805)
EC50 16.1±n/a nM
Citation He, HZatorska, DKim, JAguirre, JLlauger, LShe, YWu, NImmormino, RMGewirth, DTChiosis, G Identification of potent water soluble purine-scaffold inhibitors of the heat shock protein 90. J Med Chem49:381-90 (2006) 
 
Heat shock protein HSP 90-beta
Name:Heat shock protein HSP 90-beta
Type:Molecular Chaperone
Mol. Mass.:83229.45
Organism:Homo sapiens (Human)
Description:P08238
Residue:724
BDBM50180302
NameBDBM50180302
Synonyms:8-(6-iodo-benzo[1,3]dioxol-5-ylsulfanyl)-9-(3-isopropylamino-propyl)adenine 8-[(6-IODO-1,3-BENZODIOXOL-5-YL)THIO]-9-[3-(ISOPROPYLAMINO)PROPYL]-9H-PURIN-6-AMINE US10336757, Compound PU-H71 | US10676476, Example 9
TypeSmall organic molecule
Emp. Form.C18H21IN6O2S
Mol. Mass.512.368
SMILESCC(C)NCCCn1c(Sc2cc3OCOc3cc2I)nc2c(N)ncnc12