Reaction Details
TargetTransient receptor potential cation channel subfamily V member 1
LigandBDBM50180714
Substrate/Competitorn/a
Meas. Tech.ChEMBL_326994 (CHEMBL863527)
IC50 286±n/a nM
Citation Culshaw, AJBevan, SChristiansen, MCopp, PDavis, ADavis, CDyson, ADziadulewicz, EKEdwards, LEggelte, HFox, AGentry, CGroarke, AHallett, AHart, TWHughes, GAKnights, SKotsonis, PLee, WLyothier, IMcBryde, AMcIntyre, PPaloumbis, GPanesar, MPatel, SSeiler, MPYaqoob, MZimmermann, K Identification and biological characterization of 6-aryl-7-isopropylquinazolinones as novel TRPV1 antagonists that are effective in models of chronic pain. J Med Chem49:471-4 (2006) 
 
Transient receptor potential cation channel subfamily V member 1
Name:Transient receptor potential cation channel subfamily V member 1
Type:Protein
Mol. Mass.:94960.75
Organism:Homo sapiens (Human)
Description:Q8NER1
Residue:839
BDBM50180714
NameBDBM50180714
Synonyms:6(3-ethoxy-4-methoxy-phenyl)-7-isopropyl-2-methyl-3H-quinazolin-4-one | CHEMBL381238
TypeSmall organic molecule
Emp. Form.C21H24N2O3
Mol. Mass.352.4269
SMILESCCOc1cc(ccc1OC)-c1cc2c(cc1C(C)C)nc(C)[nH]c2=O