Reaction Details
TargetTransient receptor potential cation channel subfamily V member 1
LigandBDBM50180696
Substrate/Competitorn/a
Meas. Tech.ChEMBL_326994 (CHEMBL863527)
IC50 487±n/a nM
Citation Culshaw, AJBevan, SChristiansen, MCopp, PDavis, ADavis, CDyson, ADziadulewicz, EKEdwards, LEggelte, HFox, AGentry, CGroarke, AHallett, AHart, TWHughes, GAKnights, SKotsonis, PLee, WLyothier, IMcBryde, AMcIntyre, PPaloumbis, GPanesar, MPatel, SSeiler, MPYaqoob, MZimmermann, K Identification and biological characterization of 6-aryl-7-isopropylquinazolinones as novel TRPV1 antagonists that are effective in models of chronic pain. J Med Chem49:471-4 (2006) 
 
Transient receptor potential cation channel subfamily V member 1
Name:Transient receptor potential cation channel subfamily V member 1
Type:Protein
Mol. Mass.:94960.75
Organism:Homo sapiens (Human)
Description:Q8NER1
Residue:839
BDBM50180696
NameBDBM50180696
Synonyms:6-[4-chloro-3-(2-dimethylamino-ethoxy)-phenyl]-7-isopropyl-2-methyl-3H-quinazoline-4-one | CHEMBL201528
TypeSmall organic molecule
Emp. Form.C22H27N3O2
Mol. Mass.365.4687
SMILESCC(C)c1cc2nc(C)[nH]c(=O)c2cc1-c1cccc(OCCN(C)C)c1