Reaction Details
TargetTrifunctional purine biosynthetic protein adenosine-3
LigandBDBM50027656
Substrate/Competitorn/a
Meas. Tech.ChEMBL_2236556 (CHEMBL5150452)
Ki 65±n/a nM
Citation Wang, SYuan, XHWang, SQZhao, WChen, XBYu, B FDA-approved pyrimidine-fused bicyclic heterocycles for cancer therapy: Synthesis and clinical application. Eur J Med Chem214:0 (2021) 
 
Trifunctional purine biosynthetic protein adenosine-3
Name:Trifunctional purine biosynthetic protein adenosine-3
Type:Protein
Mol. Mass.:107768.47
Organism:Homo sapiens (Human)
Description:P22102
Residue:1010
BDBM50027656
NameBDBM50027656
Synonyms:CHEBI:63616 LY-231514 US9422297, Pemetrexed
TypeSmall organic molecule
Emp. Form.C20H21N5O6
Mol. Mass.427.4106
SMILESNc1nc2[nH]cc(CCc3ccc(cc3)C(=O)N[C@@H](CCC(O)=O)C(O)=O)c2c(=O)[nH]1