Reaction Details
Target1-deoxy-D-xylulose 5-phosphate reductoisomerase
LigandBDBM50181149
Substrate/Competitorn/a
Meas. Tech.ChEMBL_345851 (CHEMBL860877)
IC50 396±n/a nM
Citation Haemers, TWiesner, JVan Poecke, SGoeman, JHenschker, DBeck, EJomaa, HVan Calenbergh, S Synthesis of alpha-substituted fosmidomycin analogues as highly potent Plasmodium falciparum growth inhibitors. Bioorg Med Chem Lett16:1888-91 (2006) 
 
1-deoxy-D-xylulose 5-phosphate reductoisomerase
Name:1-deoxy-D-xylulose 5-phosphate reductoisomerase
Type:Protein
Mol. Mass.:43384.52
Organism:Escherichia coli
Description:P45568
Residue:398
BDBM50181149
NameBDBM50181149
Synonyms:3-(N-hydroxyacetamido)-1-p-tolylpropylphosphonic acid | CHEMBL205053
TypeSmall organic molecule
Emp. Form.C12H18NO5P
Mol. Mass.287.2488
SMILESCC(=O)N(O)CCC(c1ccc(C)cc1)P(O)(O)=O