Reaction Details
TargetProstaglandin E2 receptor EP4 subtype
LigandBDBM50181274
Substrate/Competitorn/a
Meas. Tech.ChEMBL_345142 (CHEMBL869627)
IC50 1.1±n/a nM
Citation Cameron, KOLefker, BAChu-Moyer, MYCrawford, DTJardine, PDDeNinno, SLGilbert, SGrasser, WAKe, HLu, BOwen, TAParalkar, VMQi, HScott, DOThompson, DDTjoa, CMZawistoski, MP Discovery of highly selective EP4 receptor agonists that stimulate new bone formation and restore bone mass in ovariectomized rats. Bioorg Med Chem Lett16:1799-802 (2006) 
 
Prostaglandin E2 receptor EP4 subtype
Name:Prostaglandin E2 receptor EP4 subtype
Type:PROTEIN
Mol. Mass.:53381.95
Organism:Rattus norvegicus
Description:ChEMBL_1290039
Residue:488
BDBM50181274
NameBDBM50181274
Synonyms:5-(3-((S)-2-((R)-4-(3-chlorophenyl)-3-hydroxybutyl)-5-oxopyrrolidin-1-yl)propyl)thiophene-2-carboxylic acid | CHEMBL379746
TypeSmall organic molecule
Emp. Form.C22H26ClNO4S
Mol. Mass.435.964
SMILESO[C@H](CC[C@H]1CCC(=O)N1CCCc1ccc(s1)C(O)=O)Cc1cccc(Cl)c1