Reaction Details
TargetFructose-1,6-bisphosphatase 1
LigandBDBM50181321
Substrate/Competitorn/a
Meas. Tech.ChEMBL_345422 (CHEMBL861116)
IC50 6700±n/a nM
Citation Lai, CGum, RJDaly, MFry, EHHutchins, CAbad-Zapatero, Cvon Geldern, TW Benzoxazole benzenesulfonamides as allosteric inhibitors of fructose-1,6-bisphosphatase. Bioorg Med Chem Lett16:1807-10 (2006) 
 
Fructose-1,6-bisphosphatase 1
Name:Fructose-1,6-bisphosphatase 1
Type:Protein
Mol. Mass.:36843.58
Organism:Homo sapiens (Human)
Description:Liver FBPase (P09467)
Residue:338
BDBM50181321
NameBDBM50181321
Synonyms:CHEMBL381082 | N-(5-chlorobenzo[d]oxazol-2-yl)-4-(furan-3-yl)benzenesulfonamide
TypeSmall organic molecule
Emp. Form.C17H11ClN2O4S
Mol. Mass.374.798
SMILESClc1ccc2oc(NS(=O)(=O)c3ccc(cc3)-c3ccoc3)nc2c1