Reaction Details
TargetFructose-1,6-bisphosphatase 1
LigandBDBM50181336
Substrate/Competitorn/a
Meas. Tech.ChEMBL_345422 (CHEMBL861116)
IC50 3400±n/a nM
Citation Lai, CGum, RJDaly, MFry, EHHutchins, CAbad-Zapatero, Cvon Geldern, TW Benzoxazole benzenesulfonamides as allosteric inhibitors of fructose-1,6-bisphosphatase. Bioorg Med Chem Lett16:1807-10 (2006) 
 
Fructose-1,6-bisphosphatase 1
Name:Fructose-1,6-bisphosphatase 1
Type:Protein
Mol. Mass.:36843.58
Organism:Homo sapiens (Human)
Description:Liver FBPase (P09467)
Residue:338
BDBM50181336
NameBDBM50181336
Synonyms:CHEMBL206012 | N-(5-chlorobenzo[d]oxazol-2-yl)anthracene-2-sulfonamide
TypeSmall organic molecule
Emp. Form.C21H13ClN2O3S
Mol. Mass.408.858
SMILESClc1ccc2oc(NS(=O)(=O)c3ccc4cc5ccccc5cc4c3)nc2c1