Reaction Details
TargetFructose-1,6-bisphosphatase 1
LigandBDBM50181352
Substrate/Competitorn/a
Meas. Tech.ChEMBL_345422 (CHEMBL861116)
IC50 6400±n/a nM
Citation Lai, CGum, RJDaly, MFry, EHHutchins, CAbad-Zapatero, Cvon Geldern, TW Benzoxazole benzenesulfonamides as allosteric inhibitors of fructose-1,6-bisphosphatase. Bioorg Med Chem Lett16:1807-10 (2006) 
 
Fructose-1,6-bisphosphatase 1
Name:Fructose-1,6-bisphosphatase 1
Type:Protein
Mol. Mass.:36843.58
Organism:Homo sapiens (Human)
Description:Liver FBPase (P09467)
Residue:338
BDBM50181352
NameBDBM50181352
Synonyms:2,5-dichloro-N-(5-methylbenzo[d]oxazol-2-yl)benzenesulfonamide | CHEMBL205185
TypeSmall organic molecule
Emp. Form.C14H10Cl2N2O3S
Mol. Mass.357.212
SMILESCc1ccc2oc(NS(=O)(=O)c3cc(Cl)ccc3Cl)nc2c1