Reaction Details
TargetFructose-1,6-bisphosphatase 1
LigandBDBM50181350
Substrate/Competitorn/a
Meas. Tech.ChEMBL_345422 (CHEMBL861116)
IC50>50000±n/a nM
Citation Lai, CGum, RJDaly, MFry, EHHutchins, CAbad-Zapatero, Cvon Geldern, TW Benzoxazole benzenesulfonamides as allosteric inhibitors of fructose-1,6-bisphosphatase. Bioorg Med Chem Lett16:1807-10 (2006) 
 
Fructose-1,6-bisphosphatase 1
Name:Fructose-1,6-bisphosphatase 1
Type:Protein
Mol. Mass.:36843.58
Organism:Homo sapiens (Human)
Description:Liver FBPase (P09467)
Residue:338
BDBM50181350
NameBDBM50181350
Synonyms:CHEMBL205392 | N-(5-chlorobenzo[d]oxazol-2-yl)methanesulfonamide
TypeSmall organic molecule
Emp. Form.C8H7ClN2O3S
Mol. Mass.246.671
SMILESCS(=O)(=O)Nc1nc2cc(Cl)ccc2o1