Reaction Details
TargetFructose-1,6-bisphosphatase 1
LigandBDBM50181337
Substrate/Competitorn/a
Meas. Tech.ChEMBL_345422 (CHEMBL861116)
IC50 3500±n/a nM
Citation Lai, CGum, RJDaly, MFry, EHHutchins, CAbad-Zapatero, Cvon Geldern, TW Benzoxazole benzenesulfonamides as allosteric inhibitors of fructose-1,6-bisphosphatase. Bioorg Med Chem Lett16:1807-10 (2006) 
 
Fructose-1,6-bisphosphatase 1
Name:Fructose-1,6-bisphosphatase 1
Type:Protein
Mol. Mass.:36843.58
Organism:Homo sapiens (Human)
Description:Liver FBPase (P09467)
Residue:338
BDBM50181337
NameBDBM50181337
Synonyms:2,5-dichloro-N-(5-methoxy-7-(4-methoxypyridin-3-yl)benzo[d]oxazol-2-yl)benzenesulfonamide | CHEMBL381536
TypeSmall organic molecule
Emp. Form.C20H15Cl2N3O5S
Mol. Mass.480.321
SMILESCOc1cc(-c2cnccc2OC)c2oc(NS(=O)(=O)c3cc(Cl)ccc3Cl)nc2c1