Reaction Details
TargetNociceptin receptor
LigandBDBM50181392
Substrate/Competitorn/a
Meas. Tech.ChEMBL_331366 (CHEMBL865853)
IC50 0.150000±n/a nM
Citation Goto, YArai-Otsuki, STachibana, YIchikawa, DOzaki, STakahashi, HIwasawa, YOkamoto, OOkuda, SOhta, HSagara, T Identification of a novel spiropiperidine opioid receptor-like 1 antagonist class by a focused library approach featuring 3D-pharmacophore similarity. J Med Chem49:847-9 (2006) 
 
Nociceptin receptor
Name:Nociceptin receptor
Type:G Protein-Coupled Receptor (GPCR)
Mol. Mass.:40702.87
Organism:Homo sapiens (Human)
Description:P41146
Residue:370
BDBM50181392
NameBDBM50181392
Synonyms:(R)-N-(3-(3H-spiro[isobenzofuran-1,4'-piperidine]-1'-yl)propyl)-1-benzylpyrrolidine-2-carboxamide CHEMBL201945
TypeSmall organic molecule
Emp. Form.C27H35N3O2
Mol. Mass.433.5857
SMILESO=C(NCCCN1CCC2(CC1)OCc1ccccc21)[C@H]1CCCN1Cc1ccccc1