Reaction Details
TargetNociceptin receptor
LigandBDBM50181395
Substrate/Competitorn/a
Meas. Tech.ChEMBL_331366 (CHEMBL865853)
IC50 0.120000±n/a nM
Citation Goto, YArai-Otsuki, STachibana, YIchikawa, DOzaki, STakahashi, HIwasawa, YOkamoto, OOkuda, SOhta, HSagara, T Identification of a novel spiropiperidine opioid receptor-like 1 antagonist class by a focused library approach featuring 3D-pharmacophore similarity. J Med Chem49:847-9 (2006) 
 
Nociceptin receptor
Name:Nociceptin receptor
Type:G Protein-Coupled Receptor (GPCR)
Mol. Mass.:40702.87
Organism:Homo sapiens (Human)
Description:P41146
Residue:370
BDBM50181395
NameBDBM50181395
Synonyms:1-benzyl-N-[3-spiro(2,3-dihydro-1H-indene-1,4'-piperidine)-1-ylpropyl]-D-prolineamide | CHEMBL202225
TypeSmall organic molecule
Emp. Form.C28H37N3O
Mol. Mass.431.6129
SMILESO=C(NCCCN1CCC2(CCc3ccccc23)CC1)[C@H]1CCCN1Cc1ccccc1