Reaction Details
TargetNociceptin receptor
LigandBDBM50181366
Substrate/Competitorn/a
Meas. Tech.ChEMBL_331362 (CHEMBL867087)
IC50 21±n/a nM
Citation Goto, YArai-Otsuki, STachibana, YIchikawa, DOzaki, STakahashi, HIwasawa, YOkamoto, OOkuda, SOhta, HSagara, T Identification of a novel spiropiperidine opioid receptor-like 1 antagonist class by a focused library approach featuring 3D-pharmacophore similarity. J Med Chem49:847-9 (2006) 
 
Nociceptin receptor
Name:Nociceptin receptor
Type:G Protein-Coupled Receptor (GPCR)
Mol. Mass.:40702.87
Organism:Homo sapiens (Human)
Description:P41146
Residue:370
BDBM50181366
NameBDBM50181366
Synonyms:2-benzyl-N-(3-{2,3-dihydrospiro[indene-1,4'-piperidine]-1'-yl}propyl)benzamide | CHEMBL202322
TypeSmall organic molecule
Emp. Form.C30H34N2O
Mol. Mass.438.6038
SMILESO=C(NCCCN1CCC2(CCc3ccccc23)CC1)c1ccccc1Cc1ccccc1