Reaction Details
TargetNociceptin receptor
LigandBDBM50181378
Substrate/Competitorn/a
Meas. Tech.ChEMBL_331362 (CHEMBL867087)
IC50 24±n/a nM
Citation Goto, YArai-Otsuki, STachibana, YIchikawa, DOzaki, STakahashi, HIwasawa, YOkamoto, OOkuda, SOhta, HSagara, T Identification of a novel spiropiperidine opioid receptor-like 1 antagonist class by a focused library approach featuring 3D-pharmacophore similarity. J Med Chem49:847-9 (2006) 
 
Nociceptin receptor
Name:Nociceptin receptor
Type:G Protein-Coupled Receptor (GPCR)
Mol. Mass.:40702.87
Organism:Homo sapiens (Human)
Description:P41146
Residue:370
BDBM50181378
NameBDBM50181378
Synonyms:(4R)-3-benzyl-N-(3-{2,3-dihydrospiro[indene-1,4'-piperidine]-1'-yl}propyl)-2-oxo-1,3-oxazolidine-4-carboxamide | CHEMBL202492
TypeSmall organic molecule
Emp. Form.C27H33N3O3
Mol. Mass.447.5692
SMILESO=C(NCCCN1CCC2(CCc3ccccc23)CC1)[C@H]1COC(=O)N1Cc1ccccc1